{"text_format":"1","workbook":"xlsx","n_sheets":28,"sheets":["B8","B9","B11","Atomic","ANTOINE","KOPPS","B3","Sheet1","Introduction","Chapter2","Chapter 3","Chapter 4","Chapter 5","Chapter 6","Chapter 7","Chapter 8","Chapter 9","Chapter 10","Chapter 11","B6","B5","B7","B7L","Steam Tables","Species","B1","B2","Solver"],"not_rendered":{"charts":0,"images":3,"macros":1,"external_links":0,"defined_names":61,"comments":9,"pivot_tables":0},"unopened":[],"bounds":{"document_bytes":16777216,"sheet_cells":100000,"rows_first":2000,"rows_last":500,"rows_between":2000,"halvings":0,"cell_chars":16384,"cell_head_chars":4096},"cells_cut":0,"cells_raw":0,"read":"whole","date_system":"1900"}

{"sheet":"B8","index":0,"n_rows":22,"n_cols":8,"rows_kept":22,"cut":false,"hidden":true,"merged":[]}
["Specific Enthalpies of Selected Gases: SI Units, Ĥ (kJ/mol)"]
[]
["Reference state: Gas, Pref = 1atm, Tref = 25°C"]
[]
["T","Air","O2","N2","H2","CO","CO2","H2O"]
[0,-0.72,-0.73,-0.73,-0.72,-0.73,-0.92,-0.84]
[25,0,0,0,0,0,0,0]
[100,2.19,2.2400000000000002,2.19,2.16,2.19,2.9,2.54]
[200,5.15,5.31,5.13,5.0599999999999996,5.16,7.08,6.01]
[300,8.17,8.4700000000000006,8.1199999999999992,7.96,8.17,11.58,9.57]
{"$rows_left_out":13}
{"sheet":"B9","index":1,"n_rows":27,"n_cols":8,"rows_kept":27,"cut":false,"hidden":true,"merged":[]}
["Speicific Enthalpies of Selected Gases: American Engineering Units, Ĥ (Btu/lb-mole)"]
[]
["Reference state: Gas, Pref = 1atm, Tref = 77°F"]
[]
["T","Air","O2","N2","H2","CO","CO2","H2O"]
[32,-312,-315,-312,-310,-312,-394,-361]
[77,0,0,0,0,0,0,0]
[100,160,162,160,159,160,206,185]
[200,858,875,857,848,859,1132,996]
[300,1563,1602,1558,1539,1564,2108,1818]
{"$rows_left_out":18}
{"sheet":"B11","index":2,"n_rows":28,"n_cols":4,"rows_kept":28,"cut":false,"hidden":true,"merged":[[2,1,2,3]]}
["Integral Heats of Solution and Mixing at 25°C"]
[]
[null,"ΔĤs (kJ/mol)"]
["r (moleH2O/mol solute)","HCl (g)","NaOH (s)","H2SO4"]
[0.5,null,null,-15.73]
[1,-26.22,null,-28.07]
[1.5,null,null,-36.9]
[2,-48.82,null,-41.92]
[3,-56.85,-28.87,-48.99]
[4,-61.2,-34.43,-54.06]
{"$rows_left_out":19}
{"sheet":"Atomic","index":3,"n_rows":119,"n_cols":6,"rows_kept":119,"cut":false,"hidden":true,"merged":[]}
[]
[null,"Atomic Number","Symbol","Element","Atomic Weight","Unstable"]
[null,89,"Ac","Actinium",227,1]
[null,13,"Al","Aluminium",26.9815]
[null,95,"Am","Americium",243,1]
[null,51,"Sb","Antimony",121.75]
[null,18,"Ar","Argon",39.948]
[null,33,"As","Arsenic",74.921599999999998]
[null,85,"At","Astatine",210,1]
[null,56,"Ba","Barium",137.34]
{"$rows_left_out":110}
{"sheet":"ANTOINE","index":4,"n_rows":99,"n_cols":7,"rows_kept":99,"cut":false,"hidden":true,"merged":[]}
["Antione Equation Constants"]
[]
[]
["Compound","Formula","Lower Temp °C","Upper Temp °C","A","B","C"]
["1,1,1-Trichloroethane","C2H3Cl3",-5.4,16.899999999999999,8.64344,2136.6210000000001,302.76900000000001]
["1,1,2-Trichloroethane","C2H3Cl3",50,113.7,6.9518500000000003,1314.41,209.197]
["1,1-Dichloroethane","C2H4Cl2",-38.799999999999997,17.600000000000001,6.9770200000000004,1174.0219999999999,229.06]
["1,2-Dichloroethane","C2H4Cl",-30.8,99.4,7.0252999999999997,1271.2539999999999,222.92699999999999]
["1,2-Ethylenediamine","C2H8N2",26.5,117.4,7.1687099999999999,1336.2349999999999,194.36600000000001]
["1,4-Dioxane","C4H8O2",20,105,7.4315499999999997,1554.6790000000001,240.33699999999999]
{"$rows_left_out":90}
{"sheet":"KOPPS","index":5,"n_rows":14,"n_cols":6,"rows_kept":14,"cut":false,"hidden":true,"merged":[[3,1,3,2]]}
["Atomic Heat Capacities for Kopp's Rule"]
[]
[]
[null,"Cpa (J/(g-atom°C))"]
["Element","Solids","Liquids"]
["B",11,20]
["C",7.5,12]
["F",21,29]
["H",9.6,18]
["O",17,25,null,"C",1]
{"$rows_left_out":5}
{"sheet":"B3","index":6,"n_rows":88,"n_cols":12,"rows_kept":88,"cut":false,"hidden":true,"merged":[]}
["Vapor Pressure of Water"]
[]
["Pv (mmHg) versus T (°C)"]
[]
[null,"T (°C)",0,0.1,0.2,0.3,0.4,0.5,0.6,0.7,0.8,0.9]
[null,-14,1.361,1.3480000000000001,1.3360000000000001,1.3240000000000001,1.3120000000000001,1.3,1.288,1.276,1.264,1.2529999999999999]
[null,-13,1.49,1.4770000000000001,1.464,1.45,1.4370000000000001,1.4239999999999999,1.411,1.399,1.3859999999999999,1.373]
[null,-12,1.6319999999999999,1.617,1.6020000000000001,1.5880000000000001,1.5740000000000001,1.5589999999999999,1.546,1.532,1.518,1.504]
[null,-11,1.7849999999999999,1.7689999999999999,1.7529999999999999,1.7370000000000001,1.722,1.7070000000000001,1.6910000000000001,1.6759999999999999,1.661,1.6459999999999999]
[null,-10,1.95,1.9339999999999999,1.9159999999999999,1.899,1.883,1.8660000000000001,1.849,1.833,1.8169999999999999,1.8]
{"$rows_left_out":79}
{"sheet":"Sheet1","index":7,"n_rows":0,"n_cols":0,"rows_kept":0,"cut":false,"hidden":false,"merged":[]}

{"sheet":"Introduction","index":8,"n_rows":0,"n_cols":0,"rows_kept":0,"cut":false,"hidden":true,"merged":[]}

{"sheet":"Chapter2","index":9,"n_rows":60,"n_cols":18,"rows_kept":60,"cut":false,"hidden":false,"merged":[[36,1,36,2],[36,3,36,4],[36,5,36,6]]}
["Slope examples"]
[]
["Example 1:"]
["A series of meaurement of temperature versus time yields the following points:"]
[]
[null,"x","y"]
[null,0,{"$f":"3.6*B7","v":0}]
[null,2,{"$f":"3.6*B8","v":7.2}]
[null,4,14.4]
[null,6,21.6]
{"$rows_left_out":51}
{"sheet":"Chapter 3","index":10,"n_rows":37,"n_cols":8,"rows_kept":37,"cut":false,"hidden":false,"merged":[[30,0,30,1]]}
[]
[]
[]
[]
[]
[]
[]
[]
[]
[]
{"$rows_left_out":28}
{"sheet":"Chapter 4","index":11,"n_rows":0,"n_cols":0,"rows_kept":0,"cut":false,"hidden":false,"merged":[]}

{"sheet":"Chapter 5","index":12,"n_rows":16,"n_cols":17,"rows_kept":16,"cut":false,"hidden":false,"merged":[]}
[]
[]
[]
[]
[null,null,null,null,null,null,null,null,null,null,null,null,"Function","Trial of Function"]
[null,null,null,null,null,null,null,null,null,null,null,null,"MW","Acetone=",{"$f":"[0]!MW(\"Acetone\")","v":{"$error":"#VALUE!"}},"Mercury=",{"$f":"[0]!MW(\"Mercury\")","v":{"$error":"#VALUE!"}}]
[null,null,null,null,null,null,null,null,null,null,null,null,"SG","Acetone=",{"$f":"[0]!SG(\"Acetone\")","v":{"$error":"#VALUE!"}},"Mercury=",{"$f":"[0]!SG(\"Mercury\")","v":{"$error":"#VALUE!"}}]
[null,null,null,null,null,null,null,null,null,null,null,null,"Tm","Acetone=",{"$f":"[0]!Tm(\"Acetone\")","v":{"$error":"#VALUE!"}},"Mercury=",{"$f":"[0]!Tm(\"Mercury\")","v":{"$error":"#VALUE!"}}]
[null,null,null,null,null,null,null,null,null,null,null,null,"Hm","Acetone=",{"$f":"[0]!Hm(\"acetone\")","v":{"$error":"#VALUE!"}},"Carbon (Graphite)=",{"$f":"[0]!Hm(\"carbon\")","v":{"$error":"#VALUE!"}}]
[null,null,null,null,null,null,null,null,null,null,null,null,"Tb","Acetone=",{"$f":"[0]!tb(\"acetone\")","v":{"$error":"#VALUE!"}},"Mercury=",{"$f":"[0]!tb(\"mercury\")","v":{"$error":"#VALUE!"}}]
{"$rows_left_out":7}
{"sheet":"Chapter 6","index":13,"n_rows":100,"n_cols":24,"rows_kept":100,"cut":false,"hidden":false,"merged":[]}
[]
[null,null,null,null,null,null,null,null,null,null,null,null,null,null,null,null,null,null,null,null,"Example 6.3-3"]
[null,null,null,null,null,null,null,null,null,null,"Example 6.4-3  part 1",null,null,null,null,"Example 6.4-3  part 2"]
[null,null,null,null,null,null,null,null,null,null,"Xbenzene=",0.4,null,null,null,"Ybenzene=",0.1,null,null,null,null,"T(°C) =",75]
[null,null,null,null,null,null,null,null,null,null,"Xtoluene=",0.6,null,null,null,"Ytoluene=",0.1,null,null,null,null,"hr(air)=",0.3]
[null,null,null,null,null,null,null,null,null,null,"Temperature=",368.29596888849397,"K                               or",{"$f":"L6-273.15","v":95.145968888493996},"°C","Temperature=",325.60751425191307,"K           or",{"$f":"Q6-273.15","v":52.457514251913096},"°C",null,"P(mmHg)=",825]
[null,null,null,null,null,null,null,null,null,null,"P*benzene=",{"$f":"[0]!AntoineP(\"Benzene\",L6,\"K\")","v":{"$error":"#VALUE!"}},"mmHg",null,null,"P*benzene=",{"$f":"[0]!AntoineP(\"Benzene\",Q6,\"K\")","v":{"$error":"#VALUE!"}},null,null,null,"(1) Determine the molar flow rates of water, dry air, and oxygen entering the process unit"]
[null,null,null,null,null,null,null,null,null,null,"P*toluene=",{"$f":"[0]!AntoineP(\"Toluene\",L6,\"K\")","v":{"$error":"#VALUE!"}},"mmHg",null,null,"P*toluene=",{"$f":"[0]!AntoineP(\"Toluene\",Q6,\"K\")","v":{"$error":"#VALUE!"}}]
[null,null,null,null,null,null,null,null,null,null,null,null,null,null,null,null,null,null,null,null,"p*H2O(mmHg)=",{"$f":"[0]!VPWater(75)","v":{"$error":"#VALUE!"}},{"$f":"Antoine(\"water\",W4)","v":{"$error":"#NAME?"}}]
[null,null,null,null,null,null,null,null,null,null,"f(Tbp)=",{"$f":"L4*L7+L5*L8-760","v":{"$error":"#VALUE!"}},null,null,null,"f(Tdp)=",{"$f":"(Q4*Q12/Q7)+(Q5*Q12/Q8)-1","v":{"$error":"#VALUE!"}}]
{"$rows_left_out":91}
{"sheet":"Chapter 7","index":14,"n_rows":33,"n_cols":23,"rows_kept":33,"cut":false,"hidden":false,"merged":[]}
[null,null,null,null,null,null,null,null,null,"te"]
[null,null,null,null,null,null,null,null,null,null,null,null,"Example 8.3-4  (page 373)"]
[null,null,null,null,null,null,null,null,null,null,null,null,null,null,null,null,null,null,"Problem 8.18"]
[null,null,null,null,null,null,null,null,null,null,null,null,null,"n (mol/h)=",150]
[null,null,null,null,null,null,null,null,null,null,null,null,null,"nC2H6 =",0.6,null,null,null,null,null,"T1 =",45,"°C"]
[null,null,null,null,null,null,null,null,null,null,null,null,null,"nC3H8 =",0.4,null,null,null,null,null,"T2 =",20,"°C"]
[null,null,null,null,null,null,null,null,null,null,null,null,null,"T1(°C)=",0]
[null,null,null,null,null,null,null,null,null,null,null,null,null,"T2(°C)=",400,null,null,null,null,null,"xa =",0.3,"g acetone/g"]
[null,null,null,null,null,null,null,null,null,null,null,null,null,null,null,null,null,null,null,null,"xm =",0.7,"g 2-methyl-1-pentanol/g"]
[null,null,null,null,null,null,null,null,null,null,null,null,null,"∆ĤC2H6 =",{"$f":"[0]!Enthalpy(\"ethane\",O7,O8,\"c\",\"g\")","v":{"$error":"#VALUE!"}}]
{"$rows_left_out":24}
{"sheet":"Chapter 8","index":15,"n_rows":66,"n_cols":25,"rows_kept":66,"cut":false,"hidden":false,"merged":[]}
[]
[]
[null,null,null,null,null,null,null,null,null,null,null,null,null,"r","HsHCl","HsNaOH","HmH2SO4"]
[null,null,null,null,null,null,null,null,null,null,null,null,null,"inf",{"$f":"[0]!HsHCl(N4)","v":{"$error":"#VALUE!"}},{"$f":"[0]!HsNaOH(N4)","v":{"$error":"#VALUE!"}},{"$f":"[0]!HmH2SO4(N4)","v":{"$error":"#VALUE!"}}]
[null,null,null,null,null,null,null,null,null,null,null,null,null,0.5,{"$error":"#VALUE!"},{"$error":"#VALUE!"},{"$error":"#VALUE!"}]
[null,null,null,null,null,null,null,null,null,null,null,null,null,1,{"$error":"#VALUE!"},{"$error":"#VALUE!"},{"$error":"#VALUE!"}]
[null,null,null,null,null,null,null,null,null,null,null,null,null,2,{"$error":"#VALUE!"},{"$error":"#VALUE!"},{"$error":"#VALUE!"}]
[null,null,null,null,null,null,null,null,null,null,null,null,null,25,{"$error":"#VALUE!"},{"$error":"#VALUE!"},{"$error":"#VALUE!"}]
[null,null,null,null,null,null,null,null,null,null,null,null,null,30,{"$error":"#VALUE!"},{"$error":"#VALUE!"},{"$error":"#VALUE!"}]
[null,null,null,null,null,null,null,null,null,null,null,null,null,500000,{"$error":"#VALUE!"},{"$error":"#VALUE!"},{"$error":"#VALUE!"}]
{"$rows_left_out":57}
{"sheet":"Chapter 9","index":16,"n_rows":91,"n_cols":18,"rows_kept":91,"cut":false,"hidden":false,"merged":[]}
[]
[]
[null,null,null,null,null,null,null,null,null,"Problem 9.55"]
[]
[null,null,null,null,null,null,null,null,null,null,"Methane at 25°C is burned in a boiler furnace with 10.0% excess air preheated to 100°C. Ninety percent of the methane fed is consumed, the product"]
[null,null,null,null,null,null,null,null,null,null,"gass contains 10.0 mol CO2/mol CO, and the combustion products leave the furnace at 400°C."]
[]
[null,null,null,null,null,null,null,null,null,null,"Calculate the heat transferred from the furnace, Q(kW), for a basis of 1000 mol CH4 fed/s.( The great the value of Q, the more steam is produced in the "]
[null,null,null,null,null,null,null,null,null,null,"boiler)"]
[]
{"$rows_left_out":82}
{"sheet":"Chapter 10","index":17,"n_rows":0,"n_cols":0,"rows_kept":0,"cut":false,"hidden":false,"merged":[]}

{"sheet":"Chapter 11","index":18,"n_rows":0,"n_cols":0,"rows_kept":0,"cut":false,"hidden":false,"merged":[]}

{"sheet":"B6","index":19,"n_rows":173,"n_cols":9,"rows_kept":173,"cut":false,"hidden":true,"merged":[]}
["Properties of Saturated Steam: Pressure Table"]
[null,null,"V (m^3/kg)","V (m^3/kg)","U (kJ/kg)","U (kJ/kg)","H (kJ/kg)","H (kJ/kg)","H (kJ/kg)"]
["P(bar)","T(°C)","Water","Steam","Water","Steam","Water","Evaporation","Steam"]
[6.11E-3,0.01,1E-3,206.2,"zero",2375.6,0,2501.6,2501.6]
[8.0000000000000002E-3,3.8,1E-3,159.69999999999999,15.8,2380.6999999999998,15.8,2492.6,2508.5]
[0.01,7,1E-3,129.19999999999999,29.3,2385.1999999999998,29.3,2485,2514.4]
[1.2E-2,9.6999999999999993,1E-3,108.7,40.6,2388.9,40.6,2478.6999999999998,2519.3000000000002]
[1.4E-2,12,1E-3,93.9,50.3,2392,50.3,2473.1999999999998,2523.5]
[1.6E-2,14,1.0009999999999999E-3,82.8,58.9,2394.8000000000002,58.9,2468.4,2527.3000000000002]
[1.7999999999999999E-2,15.9,1.0009999999999999E-3,74,66.5,2397.4,66.5,2464.1,2530.6]
{"$rows_left_out":164}
{"sheet":"B5","index":20,"n_rows":55,"n_cols":9,"rows_kept":55,"cut":false,"hidden":true,"merged":[]}
[null,null,"V(m3/kg)","V(m3/kg)","U(kJ/kg)","U(kJ/kg)","H(kJ/kg)","H(kJ/kg)","H(kJ/kg)"]
["T(°C)","P(bar)","Water","Steam","Water","Steam","Water","Evaporation","Steam"]
[0.01,6.11E-3,1E-3,206.2,"zero",2375.6,0,2501.6,2501.6]
[2,7.0499999999999998E-3,1E-3,179.9,8.4,2378.3000000000002,8.4,2496.8000000000002,2505.1999999999998]
[4,8.1300000000000001E-3,1E-3,157.30000000000001,16.8,2381.1,16.8,2492.1,2508.9]
[6,9.3500000000000007E-3,1E-3,137.80000000000001,25.2,2383.8000000000002,25.2,2487.4,2512.6]
[8,1.072E-2,1E-3,121,33.6,2386.6,33.6,2482.6,2516.1999999999998]
[10,1.227E-2,1E-3,106.4,42,2389.3000000000002,42,2477.9,2519.9]
[12,1.401E-2,1E-3,93.8,50.4,2392.1,50.4,2473.1999999999998,2523.6]
[14,1.5970000000000002E-2,1.0009999999999999E-3,82.9,58.8,2394.8000000000002,58.8,2468.5,2527.1999999999998]
{"$rows_left_out":46}
{"sheet":"B7","index":21,"n_rows":57,"n_cols":20,"rows_kept":57,"cut":false,"hidden":true,"merged":[]}
["P(Tsat)","SatW","SatS",50,75,100,150,200,250,300,350,400,450,500,550,600,650,700,750,"H"]
[0,"—","—",2595,2642,2689,2784,2880,2978,3077,3177,3280,3384,3497,3597,3706,3816,3929,4043]
[0.1,191.8,2584.8000000000002,2593,2640,2688,2783,2880,2977,3077,3177,3280,3384,3489,3596,3706,3816,3929,4043]
[0.5,340.6,2646,null,null,2683,2780,2878,2979,3076,3177,3279,3383,3489,3596,3705,3816,3929,4043]
[1,417.5,2675.4,null,null,2676,2776,2875,2975,3074,3176,3278,3382,3488,3596,3705,3816,3928,4042]
[5,640.1,2747.5,null,null,null,null,2855,2961,3065,3168,3272,3379,3484,3592,3702,3813,3926,4040]
[10,762.6,2776.2,null,null,null,null,2827,2943,3052,3159,3264,3371,3478,3587,3697,3809,3923,4038]
[20,908.6,2797.2,null,null,null,null,null,2902,3025,3139,3249,3358,3467,3578,3689,3802,3916,4032]
[40,1087.4000000000001,2800.3,null,null,null,null,null,null,2962,3095,3216,3331,3445,3559,3673,3788,3904,4021]
[60,1213.7,2785,null,null,null,null,null,null,2885,3046,3180,3303,3422,3539,3657,3774,3892,4011]
{"$rows_left_out":48}
{"sheet":"B7L","index":22,"n_rows":57,"n_cols":20,"rows_kept":57,"cut":false,"hidden":true,"merged":[]}
["P(Tsat)","SatW","SatS",50,75,100,150,200,250,300,350,400,450,500,550,600,650,700,750,"H"]
[0,"—","—"]
[0.1,191.8,2584.8000000000002]
[0.5,340.6,2646,209.3,313.89999999999998]
[1,417.5,2675.4,209.3,314]
[5,640.1,2747.5,209.7,314.3,419.4,632.20000000000005]
[10,762.6,2776.2,210.1,314.7,419.7,632.5]
[20,908.6,2797.2,211,315.5,420.5,633.1,852.6]
[40,1087.4000000000001,2800.3,212.7,317.10000000000002,422,634.29999999999995,853.4,1085.8]
[60,1213.7,2785,214.4,318.7,423.5,635.6,854.2,1085.8]
{"$rows_left_out":48}
{"sheet":"Steam Tables","index":23,"n_rows":28,"n_cols":13,"rows_kept":28,"cut":false,"hidden":true,"merged":[]}
["ST"]
[]
["Temperature","P",null,102]
[{"$f":"[0]!SteamSatT(50,\"t\",\"p\")","v":{"$error":"#VALUE!"}},null,null,"T"]
[{"$f":"[0]!SteamSatT(51,\"t\",\"p\")","v":{"$error":"#VALUE!"}},{"$f":"+(0.1361+0.1234)/2","v":0.12975},null,"h",null,null,null,null,null,"Input ",40,"P"]
[null,null,null,"e",null,null,null,null,null,"Input2",1.06E-3,"V"]
[null,null,null,{"$f":"[0]!SteamSatT(D3,D4,D5,D6)","v":{"$error":"#VALUE!"}},null,null,{"$f":"[0]!SteamSH(90,625,\"P\",\"T\",\"H\")","v":{"$error":"#VALUE!"}},{"$f":"3640+3759","v":7399},{"$f":"[0]!SteamSH(625,90,\"T\",\"P\",\"H\")","v":{"$error":"#VALUE!"}},"T",{"$f":"[0]!SteamSH(K5,K6,L5,L6,J7,\"l\")","v":{"$error":"#VALUE!"}},null,{"$f":"MATCH(3252, 'B7'!P21:P38, -1)","v":10}]
[null,null,null,null,null,null,{"$f":"[0]!SteamSH(90,600,\"P\",\"T\",\"H\")","v":{"$error":"#VALUE!"}},{"$f":"+H7/2","v":3699.5},{"$f":"[0]!SteamSH(90,600,\"P\",\"T\",\"H\")","v":{"$error":"#VALUE!"}}]
["Pressure",null,null,102,null,null,{"$f":"[0]!SteamSH(90,650,\"P\",\"T\",\"H\")","v":{"$error":"#VALUE!"}},null,{"$f":"[0]!SteamSH(90,650,\"P\",\"T\",\"H\")","v":{"$error":"#VALUE!"}}]
[{"$f":"[0]!SteamSatP(1.1,\"p\",\"t\")","v":{"$error":"#VALUE!"}},null,null,"T",null,null,{"$f":"AVERAGE(G8:G9)","v":{"$error":"#VALUE!"}}]
{"$rows_left_out":19}
{"sheet":"Species","index":24,"n_rows":177,"n_cols":12,"rows_kept":177,"cut":false,"hidden":false,"merged":[]}
["Text Name","CAS","Formula","Synonyms, tradenames, variations",null,null,null,"Source: en.wikipedia.org, CDC-NIOSH Pocket Guide to Chemical Hazards"]
["acetaldehyde","75-07-0","CH3CHO","Acetic aldehyde","Ethanal","Ethyl aldehyde","C2H4O"]
["acetic acid","64-19-7","CH3COOH","Acetic acid (aqueous)","Ethanoic acid","Glacial acetic acid","Methanecarboxylic acid","vinegar","C2H4O2"]
["acetic anhydride","108-24-7","(CH3CO)2O","Acetic acid anhydride","Acetic oxide","Acetyl oxide","Ethanoic anhydride","C4H6O3"]
["acetone","67-64-1","(ch3)2co","dimethyl ketone","2-propanone","ketone propane","","","","",""]
["acetylene","74-86-2","c2h2","ethine","ethyne","hcch","hc≡ch ","","","",""]
["acrylic acid","79-10-7","CH2CHCOOH","CH2=CHCOOH","Acroleic acid","Aqueous acrylic acid","Ethylenecarboxylic acid","Glacial acrylic acid","2-Propenoic acid","C3H4O2",""]
["air","","","","","","","","","",""]
["ammonia","7664-41-7","nh3","anhydrous ammonia","aqua ammonia","aqueous ammonia","","","","",""]
["ammonium hydroxide","1336-21-6","NH4OH","ammonia water","ammonical liquor","ammonia liquor","aqua ammonia","","","",""]
{"$rows_left_out":168}
{"sheet":"B1","index":25,"n_rows":136,"n_cols":22,"rows_kept":136,"cut":false,"hidden":true,"merged":[[2,3,2,4],[2,14,2,17],[2,18,2,21]]}
["Physical Properties"]
[]
["Compound","Formula","Mol Wt","SG",null,"Tm  ","ΔĤ m (Tm )","Tb","T(decomp)","T(sublim)","T(ingite)","ΔĤ v (Tb)","Tc","Pc","ΔĤf° (kJ/mol)",null,null,null,"ΔĤc° (kJ/mol)"]
[null,null,null,"ref. Temp","value","°C","kJ/mol","°C","°C","°C","°C","kJ/mol","K","atm","(g)","(l)","(aq)","( c)","(g)","(l)","(c )","(s)"]
["Acetaldehyde","CH3CHO",44.05,18,0.78300000000000003,-123.7,null,20.2,null,null,null,25.1,461,null,-166.2,null,null,null,-1192.4000000000001]
["Acetic acid","CH3COOH",60.05,"20/4",1.0489999999999999,16.600000000000001,12.09,118.2,null,null,null,24.39,594.79999999999995,57.1,-438.15,-486.18,null,null,-919.73,-871.69]
["Acetone","C3H6O",58.08,"20/4",0.79100000000000004,-95,5.69,56,null,null,null,30.2,508,47,-216.7,-248.2,null,null,-1821.4,-1785.7]
["Acetylene","C2H2",26.04,null,null,null,null,-81.5,null,null,null,17.600000000000001,309.5,61.6,226.75,null,null,null,-1299.5999999999999]
["Ammonia","NH3",17.03,null,null,-77.8,5.6529999999999996,-33.43,null,null,null,23.350999999999999,405.5,111.3,-46.19,-67.2,null,null,-382.58]
["Ammonium hydroxide","NH4OH",35.03,null,null,null,null,null,null,null,null,null,null,null,null,null,-366.48]
{"$rows_left_out":127}
{"sheet":"B2","index":26,"n_rows":73,"n_cols":12,"rows_kept":73,"cut":false,"hidden":true,"merged":[]}
["Heat Capacities"]
[]
["Compound","Formula","Mol. Wt.","State","Form","Temp. Unit","a*10^3","b*10^5","c*10^8","d*10^12","Lower limit","Upper limit"]
["Acetone","CH3COCH3",58.08,"l",1,"C",123,18.600000000000001,null,null,-30,60]
["Acetone","CH3COCH3",58.08,"g",1,"C",71.959999999999994,20.100000000000001,-12.78,34.76,0,1200]
["Acetylene","C2H2",26.04,"g",1,"C",42.43,6.0529999999999999,-5.0330000000000004,18.2,0,1200]
["Air",null,29,"g",1,"C",28.94,0.41470000000000001,0.31909999999999999,-1.9650000000000001,0,1500]
["Air",null,29,"g",1,"K",28.09,0.19650000000000001,0.47989999999999999,-1.9650000000000001,273,1800]
["Ammonia","NH3",17.03,"g",1,"C",35.15,2.9540000000000002,0.44209999999999999,-6.6859999999999999,0,1200]
["Ammonium Sulfate","N2H8SO4",132.15,"c",1,"K",215.9,null,null,null,275,328]
{"$rows_left_out":64}
{"sheet":"Solver","index":27,"n_rows":31,"n_cols":11,"rows_kept":31,"cut":false,"hidden":false,"merged":[]}
[]
["Variables:","n1","n2","n3","n4","n5","n6","n7","n8"]
["Values:",17.696750869566571,23.090031783905591,44.584879268642737,14.631024417407591,42.748222112732797,20.567853296457333,5.000022298187802,13.992419416805889]
["8 variables require 8 equations"]
[null,"LHS","RHS","(LHS-RHS)^2"]
[1,35,{"$f":"0.673*B3+C3","v":34.999945119123893},{"$f":"(B6-C6)^2","v":3.0119105622413805E-9}]
[2,50,{"$f":"0.306*B3+D3","v":50.000085034730105},{"$f":"(B7-C7)^2","v":7.2309053240895301E-9}]
[3,15,{"$f":"0.021*B3+E3","v":15.002656185668489},7.0553223054841004E-6]
[4,{"$f":"+C3","v":23.090031783905591},{"$f":"0.059*F3+G3","v":23.089998401108566},1.1144111371771411E-9]
[5,{"$f":"+D3","v":44.584879268642737},{"$f":"0.926*F3+H3","v":44.584875974578374},1.0850860030890857E-11]
{"$rows_left_out":21}